{"text_format":"1","workbook":"xlsx","n_sheets":13,"sheets":["Schedule","2023_Trains","Membership Schedule","Master ","Sheet2","02-01","Blank Sheet","list2","DATA_Lists","Revisions","Old 2023_Trains","Duplicate Master","Old Master"],"not_rendered":{"charts":0,"images":1,"macros":1,"external_links":1,"defined_names":4,"comments":0,"pivot_tables":0},"unopened":[],"bounds":{"document_bytes":16777216,"sheet_cells":100000,"rows_first":2000,"rows_last":500,"rows_between":2000,"halvings":0,"cell_chars":16384,"cell_head_chars":4096},"cells_cut":0,"cells_raw":0,"read":"whole","date_system":"1900"}

{"sheet":"Schedule","index":0,"n_rows":57,"n_cols":11,"rows_kept":57,"cut":false,"hidden":false,"merged":[]}
[]
[null," ","                               2023 Schedule"]
[null,null,null,null,null,null,null,null,null,"Total Ridership YTD",{"$f":"TODAY()","v":"2023-03-19"}]
[]
[null,"Index","Date",null," Trains",1,2,3,4,5,"Theme "]
[]
[]
[null,1,"2023-02-01",{"$f":"IF(C8=0,\" \",TEXT(C8,\"ddd\"))","v":"Wed"},1,"10:30",null,null,null,null,"Photo shoot"]
[null,2,"2023-04-01","Sat",5,"9:30","11:00","12:30","2:00","3:30","Hop into Spring"]
[null,3,"2023-04-02","Sun",5,"9:30","11:00","12:30","2:00","3:30","Hop into Spring"]
[null,4,"2023-04-12","Wed",1,"10:30",null,null,null,null,"Group ride"]
[null,5,"2023-04-15","Sat",4,"11:00","12:00","1:00","2:00",null,"Operate-A-Loco"]
[null,6,"2023-04-21","Fri",1,"10:30",null,null,null,null,"Group ride"]
[null,7,"2023-05-06","Sat",4,"1:00","2:30","4:00","5:30",null,"Brew & Choo"]
[null,8,"2023-05-12","Fri",1,"10:30",null,null,null,null,"Group ride"]
{"$rows_left_out":43}
{"sheet":"2023_Trains","index":1,"n_rows":56,"n_cols":13,"rows_kept":56,"cut":false,"hidden":false,"merged":[]}
[]
[null," ","      2023 Schedule and Ridership"]
[null,null,null,null,null,null,null,null,null,"Total Ridership YTD",{"$f":"SUM(K7:K138)","v":1},null,{"$f":"TODAY()","v":"2023-03-19"}]
[]
[null,"Index","Date",null," Trains",1,2,3,4,5,"Riders","Average ","Theme "]
[]
[null,1,"2023-02-01",{"$f":"IF(C7=0,\" \",TEXT(C7,\"ddd\"))","v":"Wed"},1,"10:30 am",null,null,null,null,1,null,"Photo shoot"]
[null,2,"2023-04-01","Sat",5,"9:30 am","11:00 am","12:30 pm","2:15 pm","3:45 pm",null,null,"Hop into Spring"]
[null,3,"2023-04-02","Sun",5,"9:30 am","11:00 am","12:30 pm","2:15 pm","3:45 pm",null,null,"Hop into Spring"]
[null,4,"2023-04-12","Wed",1,"10:30 am",null,null,null,null,null,null,"Group ride"]
[null,5,"2023-04-15","Sat",4,"11:00 am","12:00  pm","1:00 pm","2:00 pm",null,null,null,"Operate-A-Loco"]
[null,6,"2023-04-21","Fri",1,"10:30 am",null,null,null,null,null,null,"Group ride"]
[null,7,"2023-05-06","Sat",4,"1:00 pm","2:30 pm","4:00 pm","5:30 pm",null,null,null,"Brew & Choo"]
[null,8,"2023-05-12","Fri",1,"10:30 am",null,null,null,null,null,null,"Group ride"]
[null,9,"2023-05-13","Sat",4,"11:00 am","12:00  pm","1:00 pm","2:00 pm",null,null,null,"Operate-A-Loco"]
{"$rows_left_out":42}
{"sheet":"Membership Schedule","index":2,"n_rows":42,"n_cols":21,"rows_kept":42,"cut":false,"hidden":false,"merged":[]}
[]
[]
[]
[]
[]
[]
[null,null,null,null,null,null,null,null,null,"Membership Events Schedule 2023",null,null,null,null,null,null,null,null,"ctrl-s","ctrl-m",{"$f":"TODAY()","v":"2023-03-19"}]
[]
[1,"2023-02-01",{"$f":"IF(B9=0,\" \",TEXT(B9,\"ddd\"))","v":"Wed"},1,"10:30",null,null,null,null,"Photo shoot"]
[2,"2023-03-16","Thu",null,"06:00:00",null,null,null,null,"Board of Directors Meeting",null,37,"2023-08-05",{"$f":"IF(M10=0,\" \",TEXT(M10,\"ddd\"))","v":"Sat"},4,"1:00","2:30","4:00","5:30",null,"Brew & Choo"]
[3,"2023-03-25","Sat",null,"10:00:00",null,null,null,null,"New Member Orientation",null,38,"2023-08-11","Fri",1,"10:30",null,null,null,null,"Group ride"]
[4,"2023-03-25","Sat",null,null,null,null,null,null,"Rules and safety Training",null,39,"2023-08-16","Wed",1,"10:30",null,null,null,null,"Group ride"]
[5,"2023-04-01","Sat",5,"9:30","11:00","12:30","2:15","3:45","Hop into Spring",null,40,"2023-08-17","Thu",null,"06:00:00",null,null,null,null,"Board of Directors Meeting"]
[6,"2023-04-02","Sun",5,"9:30","11:00","12:30","2:15","3:45","Hop into Spring",null,41,"2023-08-19","Sat",4,"11:00","12:00","1:00","2:00",null,"Operate-A-Loco"]
[7,"2023-04-12","Wed",1,"10:30",null,null,null,null,"Group ride",null,42,"2023-08-25","Fri",1,"10:30",null,null,null,null,"Group ride"]
{"$rows_left_out":28}
{"sheet":"Master ","index":3,"n_rows":52,"n_cols":13,"rows_kept":52,"cut":false,"hidden":false,"merged":[[0,1,0,12],[1,7,1,9]]}
[null,"New Hope Valley Railway"]
[null,"TIMETABLE 7",null,null,null,"DATE:",null,null,null,null,null,"R","Bonsal, NC"]
[]
[null,null,null,null,null,null,null,{"$f":"IF(H2=0,\" \",VLOOKUP(H2,'2023_Trains'!C8:M59,11,))","v":" "}]
[null,"PART 1: PASSENGER COUNT"]
[null,"SCHEDULED TIME",null,{"$f":"IF($H$2=0,\" \",IF(VLOOKUP($H$2,'2023_Trains'!$C$7:$M$60,4)=0,\" \",VLOOKUP($H$2,'2023_Trains'!$C$7:$M$60,4,FALSE)))","v":" "},null,{"$f":"IF($H$2=0,\" \",IF(VLOOKUP($H$2,'2023_Trains'!$C$7:$M$60,5)=0,\" \",VLOOKUP($H$2,'2023_Trains'!$C$7:$M$60,5,FALSE)))","v":" "},null,{"$f":"IF($H$2=0,\" \",IF(VLOOKUP($H$2,'2023_Trains'!$C$7:$M$60,6)=0,\" \",VLOOKUP($H$2,'2023_Trains'!$C$7:$M$60,6,FALSE)))","v":" "},null,{"$f":"IF($H$2=0,\" \",IF(VLOOKUP($H$2,'2023_Trains'!$C$7:$M$60,7)=0,\" \",VLOOKUP($H$2,'2023_Trains'!$C$7:$M$60,7,FALSE)))","v":" "},null,{"$f":"IF($H$2=0,\" \",IF(VLOOKUP($H$2,'2023_Trains'!$C$7:$M$60,8)=0,\" \",VLOOKUP($H$2,'2023_Trains'!$C$7:$M$60,8,FALSE)))","v":" "}]
[null,"TRAIN NUMBER",null,{"$f":"IF(D6=\" \",\" \",VALUE(D6))","v":" "},null,{"$f":"IF(F6=\" \",\" \",VALUE(F6))","v":" "},null,{"$f":"IF(H6=\" \",\" \",VALUE(H6))","v":" "},null," ",null," "]
[null,"ENGINE:"]
[]
[null,"MP 0.1 - Depart Northbound",null,{"$f":"IF(C10=0,\" \",TIMEVALUE(LEFT(C10,2)&\":\"&MID(C10,3,2)&\":\"&RIGHT(C10,2)))","v":" "},null," ",null,{"$f":"IF(G10=0,\" \",TIMEVALUE(LEFT(G10,2)&\":\"&MID(G10,3,2)&\":\"&RIGHT(G10,2)))","v":" "},null,{"$f":"IF(I10=0,\" \",TIMEVALUE(LEFT(I10,2)&\":\"&MID(I10,3,2)&\":\"&RIGHT(I10,2)))","v":" "},null,{"$f":"IF(K10=0,\" \",TIMEVALUE(LEFT(K10,2)&\":\"&MID(K10,3,2)&\":\"&RIGHT(K10,2)))","v":" "}]
[null,"Yard Limits*"]
[null,"MP 2.1 - Midway Northbound",null,{"$f":"IF(C12=0,\" \",TIMEVALUE(LEFT(C12,2)&\":\"&MID(C12,3,2)&\":\"&RIGHT(C12,2)))","v":" "},null,{"$f":"IF(E12=0,\" \",TIMEVALUE(LEFT(E12,2)&\":\"&MID(E12,3,2)&\":\"&RIGHT(E12,2)))","v":" "},null,{"$f":"IF(G12=0,\" \",TIMEVALUE(LEFT(G12,2)&\":\"&MID(G12,3,2)&\":\"&RIGHT(G12,2)))","v":" "},null,{"$f":"IF(I12=0,\" \",TIMEVALUE(LEFT(I12,2)&\":\"&MID(I12,3,2)&\":\"&RIGHT(I12,2)))","v":" "},null,{"$f":"IF(K12=0,\" \",TIMEVALUE(LEFT(K12,2)&\":\"&MID(K12,3,2)&\":\"&RIGHT(K12,2)))","v":" "}]
[null,"MP 4.1 - Arr.  New Hill",null,{"$f":"IF(C13=0,\" \",TIMEVALUE(LEFT(C13,2)&\":\"&MID(C13,3,2)&\":\"&RIGHT(C13,2)))","v":" "},null,{"$f":"IF(E13=0,\" \",TIMEVALUE(LEFT(E13,2)&\":\"&MID(E13,3,2)&\":\"&RIGHT(E13,2)))","v":" "},null,{"$f":"IF(G13=0,\" \",TIMEVALUE(LEFT(G13,2)&\":\"&MID(G13,3,2)&\":\"&RIGHT(G13,2)))","v":" "},null,{"$f":"IF(I13=0,\" \",TIMEVALUE(LEFT(I13,2)&\":\"&MID(I13,3,2)&\":\"&RIGHT(I13,2)))","v":" "},null,{"$f":"IF(K13=0,\" \",TIMEVALUE(LEFT(K13,2)&\":\"&MID(K13,3,2)&\":\"&RIGHT(K13,2)))","v":" "}," "]
[null,"MP 4.1- Lv. New Hill - Southbound",null,{"$f":"IF(C14=0,\" \",TIMEVALUE(LEFT(C14,2)&\":\"&MID(C14,3,2)&\":\"&RIGHT(C14,2)))","v":" "},null,{"$f":"IF(E14=0,\" \",TIMEVALUE(LEFT(E14,2)&\":\"&MID(E14,3,2)&\":\"&RIGHT(E14,2)))","v":" "},null,{"$f":"IF(G14=0,\" \",TIMEVALUE(LEFT(G14,2)&\":\"&MID(G14,3,2)&\":\"&RIGHT(G14,2)))","v":" "},null,{"$f":"IF(I14=0,\" \",TIMEVALUE(LEFT(I14,2)&\":\"&MID(I14,3,2)&\":\"&RIGHT(I14,2)))","v":" "},null,{"$f":"IF(K14=0,\" \",TIMEVALUE(LEFT(K14,2)&\":\"&MID(K14,3,2)&\":\"&RIGHT(K14,2)))","v":" "}]
[null,"MP 2.1 - Midway Southbound",null," ",null," ",null," ",null," ",null," "]
{"$rows_left_out":38}
{"sheet":"Sheet2","index":4,"n_rows":52,"n_cols":13,"rows_kept":52,"cut":false,"hidden":false,"merged":[[0,1,0,12],[1,7,1,9]]}
[null,"New Hope Valley Railway"]
[null,"TIMETABLE 7",null,null,null,"DATE:",null,null,null,null,null,"R","Bonsal, NC"]
[]
[null,null,null,null,null,null,null,{"$f":"IF(H2=0,\" \",VLOOKUP(H2,'2023_Trains'!C8:M59,11,))","v":" "}]
[null,"PART 1: PASSENGER COUNT"]
[null,"SCHEDULED TIME",null,{"$f":"IF($H$2=0,\" \",IF(VLOOKUP($H$2,'2023_Trains'!$C$7:$M$60,4)=0,\" \",VLOOKUP($H$2,'2023_Trains'!$C$7:$M$60,4,FALSE)))","v":" "},null,{"$f":"IF($H$2=0,\" \",IF(VLOOKUP($H$2,'2023_Trains'!$C$7:$M$60,5)=0,\" \",VLOOKUP($H$2,'2023_Trains'!$C$7:$M$60,5,FALSE)))","v":" "},null,{"$f":"IF($H$2=0,\" \",IF(VLOOKUP($H$2,'2023_Trains'!$C$7:$M$60,6)=0,\" \",VLOOKUP($H$2,'2023_Trains'!$C$7:$M$60,6,FALSE)))","v":" "},null,{"$f":"IF($H$2=0,\" \",IF(VLOOKUP($H$2,'2023_Trains'!$C$7:$M$60,7)=0,\" \",VLOOKUP($H$2,'2023_Trains'!$C$7:$M$60,7,FALSE)))","v":" "},null,{"$f":"IF($H$2=0,\" \",IF(VLOOKUP($H$2,'2023_Trains'!$C$7:$M$60,8)=0,\" \",VLOOKUP($H$2,'2023_Trains'!$C$7:$M$60,8,FALSE)))","v":" "}]
[null,"TRAIN NUMBER",null,{"$f":"IF(D6=\" \",\" \",VALUE(D6))","v":" "},null,{"$f":"IF(F6=\" \",\" \",VALUE(F6))","v":" "},null,{"$f":"IF(H6=\" \",\" \",VALUE(H6))","v":" "},null," ",null," "]
[null,"ENGINE:"]
[]
[null,"MP 0.1 - Depart Northbound",null,{"$f":"IF(C10=0,\" \",TIMEVALUE(LEFT(C10,2)&\":\"&MID(C10,3,2)&\":\"&RIGHT(C10,2)))","v":" "},null," ",null,{"$f":"IF(G10=0,\" \",TIMEVALUE(LEFT(G10,2)&\":\"&MID(G10,3,2)&\":\"&RIGHT(G10,2)))","v":" "},null,{"$f":"IF(I10=0,\" \",TIMEVALUE(LEFT(I10,2)&\":\"&MID(I10,3,2)&\":\"&RIGHT(I10,2)))","v":" "},null,{"$f":"IF(K10=0,\" \",TIMEVALUE(LEFT(K10,2)&\":\"&MID(K10,3,2)&\":\"&RIGHT(K10,2)))","v":" "}]
[null,"Yard Limits*"]
[null,"MP 2.1 - Midway Northbound",null,{"$f":"IF(C12=0,\" \",TIMEVALUE(LEFT(C12,2)&\":\"&MID(C12,3,2)&\":\"&RIGHT(C12,2)))","v":" "},null,{"$f":"IF(E12=0,\" \",TIMEVALUE(LEFT(E12,2)&\":\"&MID(E12,3,2)&\":\"&RIGHT(E12,2)))","v":" "},null,{"$f":"IF(G12=0,\" \",TIMEVALUE(LEFT(G12,2)&\":\"&MID(G12,3,2)&\":\"&RIGHT(G12,2)))","v":" "},null,{"$f":"IF(I12=0,\" \",TIMEVALUE(LEFT(I12,2)&\":\"&MID(I12,3,2)&\":\"&RIGHT(I12,2)))","v":" "},null,{"$f":"IF(K12=0,\" \",TIMEVALUE(LEFT(K12,2)&\":\"&MID(K12,3,2)&\":\"&RIGHT(K12,2)))","v":" "}]
[null,"MP 4.1 - Arr.  New Hill",null,{"$f":"IF(C13=0,\" \",TIMEVALUE(LEFT(C13,2)&\":\"&MID(C13,3,2)&\":\"&RIGHT(C13,2)))","v":" "},null,{"$f":"IF(E13=0,\" \",TIMEVALUE(LEFT(E13,2)&\":\"&MID(E13,3,2)&\":\"&RIGHT(E13,2)))","v":" "},null,{"$f":"IF(G13=0,\" \",TIMEVALUE(LEFT(G13,2)&\":\"&MID(G13,3,2)&\":\"&RIGHT(G13,2)))","v":" "},null,{"$f":"IF(I13=0,\" \",TIMEVALUE(LEFT(I13,2)&\":\"&MID(I13,3,2)&\":\"&RIGHT(I13,2)))","v":" "},null,{"$f":"IF(K13=0,\" \",TIMEVALUE(LEFT(K13,2)&\":\"&MID(K13,3,2)&\":\"&RIGHT(K13,2)))","v":" "}," "]
[null,"MP 4.1- Lv. New Hill - Southbound",null,{"$f":"IF(C14=0,\" \",TIMEVALUE(LEFT(C14,2)&\":\"&MID(C14,3,2)&\":\"&RIGHT(C14,2)))","v":" "},null,{"$f":"IF(E14=0,\" \",TIMEVALUE(LEFT(E14,2)&\":\"&MID(E14,3,2)&\":\"&RIGHT(E14,2)))","v":" "},null,{"$f":"IF(G14=0,\" \",TIMEVALUE(LEFT(G14,2)&\":\"&MID(G14,3,2)&\":\"&RIGHT(G14,2)))","v":" "},null,{"$f":"IF(I14=0,\" \",TIMEVALUE(LEFT(I14,2)&\":\"&MID(I14,3,2)&\":\"&RIGHT(I14,2)))","v":" "},null,{"$f":"IF(K14=0,\" \",TIMEVALUE(LEFT(K14,2)&\":\"&MID(K14,3,2)&\":\"&RIGHT(K14,2)))","v":" "}]
[null,"MP 2.1 - Midway Southbound",null," ",null," ",null," ",null," ",null," "]
{"$rows_left_out":38}
{"sheet":"02-01","index":5,"n_rows":52,"n_cols":14,"rows_kept":52,"cut":false,"hidden":false,"merged":[[0,1,0,12],[1,7,1,9]]}
[null,"New Hope Valley Railway"]
[null,"TIMETABLE 7",null,null,null,"DATE:",null,"2023-02-01",null,null,null,"R","Bonsal, NC"]
[]
[]
[null,"PART 1: PASSENGER COUNT"]
[null,"SCHEDULED TIME",null,"10:30:30",null," ",null," ",null," ",null," "]
[null,"TRAIN NUMBER",null,"1030"]
[null,"ENGINE:",null,1686,671]
[]
[null,"MP 0.1 - Depart Northbound","1045","10:45:45",null," ",null," ",null," ",null," "]
[null,"Yard Limits*",null,"R",null," ",null," ",null," ",null," "]
[null,"MP 2.1 - Midway Northbound",null," ",null," ",null," ",null," ",null," "]
[null,"MP 4.1 - Arr.  New Hill",null," ",null," ",null," ",null," ",null," "," "]
[null,"MP 4.1- Lv. New Hill - Southbound",null," ",null," ",null," ",null," ",null," "]
[null,"MP 2.1 - Midway Southbound",null," ",null," ",null," ",null," ",null," "]
{"$rows_left_out":38}
{"sheet":"Blank Sheet","index":6,"n_rows":52,"n_cols":9,"rows_kept":52,"cut":false,"hidden":false,"merged":[[0,1,0,7],[1,4,1,5]]}
[null,"New Hope Valley Railway"]
[null,"TIMETABLE 7",null,"DATE:",null,null,"R","Bonsal, NC"]
[]
[]
[null,"PART 1: PASSENGER COUNT"]
[null,"SCHEDULED TIME",{"$f":"IF(C7=0,\" \",TIMEVALUE(LEFT(C7,2)&\":\"&MID(C7,3,2)&\":\"&RIGHT(C7,2)))","v":" "},{"$f":"IF(D7=0,\" \",TIMEVALUE(LEFT(D7,2)&\":\"&MID(D7,3,2)&\":\"&RIGHT(D7,2)))","v":" "},{"$f":"IF(E7=0,\" \",TIMEVALUE(LEFT(E7,2)&\":\"&MID(E7,3,2)&\":\"&RIGHT(E7,2)))","v":" "},{"$f":"IF(F7=0,\" \",TIMEVALUE(LEFT(F7,2)&\":\"&MID(F7,3,2)&\":\"&RIGHT(F7,2)))","v":" "},{"$f":"IF(G7=0,\" \",TIMEVALUE(LEFT(G7,2)&\":\"&MID(G7,3,2)&\":\"&RIGHT(G7,2)))","v":" "}]
[null,"TRAIN NUMBER"]
[null,"ENGINE:"]
[]
[null,"MP 0.1 - Depart Northbound"]
[null,"Yard Limits*"]
[null,"MP 2.1 - Midway Northbound"]
[null,"MP 4.1 - Arr.  New Hill",null,null,null,null,null," "]
[null,"MP 4.1- Lv. New Hill - Southbound"]
[null,"MP 2.1 - Midway Southbound"]
{"$rows_left_out":38}
{"sheet":"list2","index":7,"n_rows":57,"n_cols":15,"rows_kept":57,"cut":false,"hidden":false,"merged":[]}
[null,"Last Name","First",null,"Last Name","First",null,"Last Name","First",null,"Last Name","First",null,"Last Name","First"]
[null,"Albers","Ray",null,"Duerst","Leslie Cohen",null,"Kaplan","Robert",null,"Obermiller","Kyle",null,"Szpunar","Mike"]
[null,"Arthur","Tommy",null,"Dunn","Ted",null,"Kearse","Mike",null,"Olsen","Dennis",null,"Taylor","Eddie"]
[null,"Barham","Mary J",null,"Edwards","Kevin",null,"Kincheloe","William",null,"Olsen","Marian",null,"Tilley","Scott"]
[null,"Barth","Sue",null,"Edwards","Teresa",null,"Koss","Linda",null,"Pace","Nicholas",null,"Tilley","Christopher H"]
[null,"Barth (71)","Paul",null,"Emmerson (63)","Paul",null,"Koss","Roger A",null,"Parker","Carol",null,"Tilley","Mikayla"]
[null,"Baschon","Paul J",null,"England","Nick",null,"Kotz","Art",null,"Pate (Whitlock)","Davette",null,"Traylor","Glenn O"]
[null,"Baschon","Sharon",null,"Eschmann","Gene ",null,"Kreuzinger","Thomas",null,"Pate (Whitlock)","Elle (18)",null,"Traylor","Janet "]
[null,"Baschon","Sara",null,"Evers","Randy",null,"Kuttner 16","Calvin",null,"Pate(26)","Joey",null,"Tredway","John"]
[null,"Bass*","Judy",null,"Evers","Carol",null,"Lackey","M Gray",null,"Payne","Scott",null,"Tredway","Suzanne"]
[null,"Becker","Scott",null,"Ezzell, Jr","Eugene W",null,"Lackey","Mack E",null,"Peterson, Jr","Stephen G",null,"Vann","John"]
[null,"Betz","John",null,"Fairbrother","Craig",null,"Lasater","Richard T",null,"Portzer","Jeffrey",null,"Vargas II","Jose"]
[null,"Betz","Grace ",null,"Fairbrother - Gallan","Cheryl",null,"Lathrop","David D.",null,"Portzet (Thomas)","Janel",null,"Varney","R. Victor"]
[null,"Blazier","Dennis",null,"Finger","John Y",null,"Lindenmuth","Matt",null,"Reagan, III","James A",null,"Walkins","Deborah"]
[null,"Bock","Richard",null,"Gagnon","Scott",null,"Lucas","Leon T",null,"Richman","Ted",null,"Walkins","Gary"]
{"$rows_left_out":43}
{"sheet":"DATA_Lists","index":8,"n_rows":217,"n_cols":24,"rows_kept":217,"cut":false,"hidden":false,"merged":[]}
[]
[null,null,null,null,null,null,null,null,null,null,null,null,"Victor Varney"]
[null,null,null,null,null,null,null,null,null,null,null,null,null,null,null,null,null,null,"Albers","Ray",{"$f":"T3&\" \"&S3","v":"Ray Albers"},null,null,"Ray Albers"]
[null,null,null,null,null,null,null,null,null,null,null,null,null,null,null,null,null,null,"Arthur","Tommy","Tommy Arthur",null,null,"Tommy Arthur"]
["Engines",null,"Brakeman",null,"Signal Operator",null,"Conductor",null,"Dispatcher",null,"Engineer",null,null,null,null,null,null,null,"Barham","Mary J","Mary J Barham",null,null,"Mary J Barham"]
[699,null,"Dennis Winchell",null,null,null,"Donald Marshall",null,"Ted Dunn",null,null,null,null,null,null,null,null,null,"Barth","Sue","Sue Barth",null,null,"Sue Barth"]
["671",null,"Harold Boettcher",null,"Chris R Boli",null,"Charles Stirewalt",null,"Richard Gray",null,"Harold Boettcher",null,null,null,null,null,null,null,"Barth (71)","Paul","Paul Barth (71)",null,null,"Paul Barth (71)"]
[1686,null,"Rob Grau",null,"Jay Horn",null,"Chris Tilley",null,"Billy Rueckert",null,"Gene Ezzell",null,null,null,null,null,null,null,"Baschon","Paul J","Paul J Baschon",null,null,"Paul J Baschon"]
[1640,null,"Joe Mills",null,"Paul Emmerson",null,"John Tredway",null,"Victor Varney",null,"Rob Grau",null,null,null,null,null,null,null,"Baschon","Sharon","Sharon Baschon",null,null,"Sharon Baschon"]
[null,null,"John Morck",null,"Dick Horn",null,"Victor Varney",null,null,null,"Roger Koss",null,null,null,null,null,null,null,"Baschon","Sara","Sara Baschon",null,null,"Sara Baschon"]
[null,null,"Brandt Wilkus",null,"Nathan DeWitt",null,null,null,null,null,"Gray Lackey",null,null,null,null,null,null,null,"Bass*","Judy","Judy Bass*",null,null,"Judy Bass*"]
[null,null,"Chris Tilley",null,"Paul Giordano",null,null,null,null,null,"Michael S MacLean",null,null,null,null,null,null,null,"Becker","Scott","Scott Becker",null,null,"Scott Becker"]
[17,null,"Charles Stirewalt",null,null,null,null,null,null,null,"Joe Mills",null,null,null,null,null,null,null,"Betz","John","John Betz",null,null,"John Betz"]
[null,null,"Victor Varney",null,null,null,null,null,null,null,"John F Morck",null,null,null,null,null,null,null,"Betz","Grace ",47,null,null,47]
[null,null,"Nick Conner",null,null,null,null,null,null,null,"Ray Albers",null,null,null,null,null,null,null,"Blazier","Dennis",{"$f":"T15&\" \"&S15","v":"Dennis Blazier"},null,null,"Dennis Blazier"]
{"$rows_left_out":203}
{"sheet":"Revisions","index":9,"n_rows":6,"n_cols":4,"rows_kept":6,"cut":false,"hidden":false,"merged":[]}
[]
[]
[null,null,"2023 Added the following features:"]
[null,null,"1- ","Automatically added check marks at yard limits   12/18/22"]
[null,null,"2- ","Automatically added 0s to passenger counts in 308 and Other 12/19/22"]
[null,null,"3-","Added am/pm to rider ship.  Auto insert Sche times and triain numbers  3/10/23"]

{"sheet":"Old 2023_Trains","index":10,"n_rows":57,"n_cols":13,"rows_kept":57,"cut":false,"hidden":false,"merged":[]}
[]
[null," ","      2023 Schedule and Ridership"]
[null,null,null,null,null,null,null,null,null,"Total Ridership YTD",null,{"$f":"SUM(K8:K58)","v":1},{"$f":"TODAY()","v":"2023-03-19"}]
[]
[null,"Index","Date",null," Trains",1,2,3,4,5,"Riders","Average ","Theme "]
[]
[]
[null,1,"2023-02-01",{"$f":"IF(C8=0,\" \",TEXT(C8,\"ddd\"))","v":"Wed"},1,"10:30",null,null,null,null,1,null,"Photo shoot"]
[null,2,"2023-04-01","Sat",5,"9:30","11:00","12:30","2:00","3:30",null,null,"Hop into Spring  1"]
[null,3,"2023-04-02","Sun",5,"9:30","11:00","12:30","2:00","3:30",null,null,"Hop into Spring  2"]
[null,4,"2023-04-12","Wed",1,"10:30",null,null,null,null,null,null,"Group ride"]
[null,5,"2023-04-15","Sat",4,"11:00","12:00","1:00","2:00",null,null,null,"Operate-A-Loco"]
[null,6,"2023-04-21","Fri",1,"10:30",null,null,null,null,null,null,"Group ride"]
[null,7,"2023-05-06","Sat",4,"1:00","2:30","4:00","5:30",null,null,null,"Brew & Choo"]
[null,8,"2023-05-12","Fri",1,"10:30",null,null,null,null,null,null,"Group ride"]
{"$rows_left_out":43}
{"sheet":"Duplicate Master","index":11,"n_rows":52,"n_cols":13,"rows_kept":52,"cut":false,"hidden":false,"merged":[[0,1,0,12],[1,7,1,9]]}
[null,"New Hope Valley Railway"]
[null,"TIMETABLE 7",null,null,null,"DATE:",null,null,null,null,null,"R","Bonsal, NC"]
[]
[null,null,null,null,null,null,null,{"$f":"IF(H2=0,\" \",VLOOKUP(H2,'2023_Trains'!C8:M59,11,))","v":" "}]
[null,"PART 1: PASSENGER COUNT"]
[null,"SCHEDULED TIME",null,{"$f":"IF($H$2=0,\" \",IF(VLOOKUP($H$2,'2023_Trains'!$C$7:$M$60,4)=0,\" \",VLOOKUP($H$2,'2023_Trains'!$C$7:$M$60,4,FALSE)))","v":" "},null,{"$f":"IF($H$2=0,\" \",IF(VLOOKUP($H$2,'2023_Trains'!$C$7:$M$60,5)=0,\" \",VLOOKUP($H$2,'2023_Trains'!$C$7:$M$60,5,FALSE)))","v":" "},null,{"$f":"IF($H$2=0,\" \",IF(VLOOKUP($H$2,'2023_Trains'!$C$7:$M$60,6)=0,\" \",VLOOKUP($H$2,'2023_Trains'!$C$7:$M$60,6,FALSE)))","v":" "},null,{"$f":"IF($H$2=0,\" \",IF(VLOOKUP($H$2,'2023_Trains'!$C$7:$M$60,7)=0,\" \",VLOOKUP($H$2,'2023_Trains'!$C$7:$M$60,7,FALSE)))","v":" "},null,{"$f":"IF($H$2=0,\" \",IF(VLOOKUP($H$2,'2023_Trains'!$C$7:$M$60,8)=0,\" \",VLOOKUP($H$2,'2023_Trains'!$C$7:$M$60,8,FALSE)))","v":" "}]
[null,"TRAIN NUMBER",null,{"$f":"IF(D6=\" \",\" \",VALUE(D6))","v":" "},null,{"$f":"IF(F6=\" \",\" \",VALUE(F6))","v":" "},null,{"$f":"IF(H6=\" \",\" \",VALUE(H6))","v":" "},null," ",null," "]
[null,"ENGINE:"]
[]
[null,"MP 0.1 - Depart Northbound",null,{"$f":"IF(C10=0,\" \",TIMEVALUE(LEFT(C10,2)&\":\"&MID(C10,3,2)&\":\"&RIGHT(C10,2)))","v":" "},null," ",null,{"$f":"IF(G10=0,\" \",TIMEVALUE(LEFT(G10,2)&\":\"&MID(G10,3,2)&\":\"&RIGHT(G10,2)))","v":" "},null,{"$f":"IF(I10=0,\" \",TIMEVALUE(LEFT(I10,2)&\":\"&MID(I10,3,2)&\":\"&RIGHT(I10,2)))","v":" "},null,{"$f":"IF(K10=0,\" \",TIMEVALUE(LEFT(K10,2)&\":\"&MID(K10,3,2)&\":\"&RIGHT(K10,2)))","v":" "}]
[null,"Yard Limits*"]
[null,"MP 2.1 - Midway Northbound",null,{"$f":"IF(C12=0,\" \",TIMEVALUE(LEFT(C12,2)&\":\"&MID(C12,3,2)&\":\"&RIGHT(C12,2)))","v":" "},null,{"$f":"IF(E12=0,\" \",TIMEVALUE(LEFT(E12,2)&\":\"&MID(E12,3,2)&\":\"&RIGHT(E12,2)))","v":" "},null,{"$f":"IF(G12=0,\" \",TIMEVALUE(LEFT(G12,2)&\":\"&MID(G12,3,2)&\":\"&RIGHT(G12,2)))","v":" "},null,{"$f":"IF(I12=0,\" \",TIMEVALUE(LEFT(I12,2)&\":\"&MID(I12,3,2)&\":\"&RIGHT(I12,2)))","v":" "},null,{"$f":"IF(K12=0,\" \",TIMEVALUE(LEFT(K12,2)&\":\"&MID(K12,3,2)&\":\"&RIGHT(K12,2)))","v":" "}]
[null,"MP 4.1 - Arr.  New Hill",null,{"$f":"IF(C13=0,\" \",TIMEVALUE(LEFT(C13,2)&\":\"&MID(C13,3,2)&\":\"&RIGHT(C13,2)))","v":" "},null,{"$f":"IF(E13=0,\" \",TIMEVALUE(LEFT(E13,2)&\":\"&MID(E13,3,2)&\":\"&RIGHT(E13,2)))","v":" "},null,{"$f":"IF(G13=0,\" \",TIMEVALUE(LEFT(G13,2)&\":\"&MID(G13,3,2)&\":\"&RIGHT(G13,2)))","v":" "},null,{"$f":"IF(I13=0,\" \",TIMEVALUE(LEFT(I13,2)&\":\"&MID(I13,3,2)&\":\"&RIGHT(I13,2)))","v":" "},null,{"$f":"IF(K13=0,\" \",TIMEVALUE(LEFT(K13,2)&\":\"&MID(K13,3,2)&\":\"&RIGHT(K13,2)))","v":" "}," "]
[null,"MP 4.1- Lv. New Hill - Southbound",null,{"$f":"IF(C14=0,\" \",TIMEVALUE(LEFT(C14,2)&\":\"&MID(C14,3,2)&\":\"&RIGHT(C14,2)))","v":" "},null,{"$f":"IF(E14=0,\" \",TIMEVALUE(LEFT(E14,2)&\":\"&MID(E14,3,2)&\":\"&RIGHT(E14,2)))","v":" "},null,{"$f":"IF(G14=0,\" \",TIMEVALUE(LEFT(G14,2)&\":\"&MID(G14,3,2)&\":\"&RIGHT(G14,2)))","v":" "},null,{"$f":"IF(I14=0,\" \",TIMEVALUE(LEFT(I14,2)&\":\"&MID(I14,3,2)&\":\"&RIGHT(I14,2)))","v":" "},null,{"$f":"IF(K14=0,\" \",TIMEVALUE(LEFT(K14,2)&\":\"&MID(K14,3,2)&\":\"&RIGHT(K14,2)))","v":" "}]
[null,"MP 2.1 - Midway Southbound",null," ",null," ",null," ",null," ",null," "]
{"$rows_left_out":38}
{"sheet":"Old Master","index":12,"n_rows":52,"n_cols":14,"rows_kept":52,"cut":false,"hidden":false,"merged":[[0,1,0,12],[1,7,1,9]]}
[null,"New Hope Valley Railway"]
[null,"TIMETABLE 7",null,null,null,"DATE:",null,null,null,null,null,"R","Bonsal, NC"]
[]
[null,null,null,null,null,null,null,{"$f":"IF(H2=0,\" \",VLOOKUP(H2,'Old 2023_Trains'!C8:M59,11))","v":" "}]
[null,"PART 1: PASSENGER COUNT"]
[null,"SCHEDULED TIME",null,{"$f":"IF(D7=0,\" \",TIMEVALUE(LEFT(D7,2)&\":\"&MID(D7,3,2)&\":\"&RIGHT(D7,2)))","v":" "},null,{"$f":"IF(F7=0,\" \",TIMEVALUE(LEFT(F7,2)&\":\"&MID(F7,3,2)&\":\"&RIGHT(F7,2)))","v":" "},null,{"$f":"IF(H7=0,\" \",TIMEVALUE(LEFT(H7,2)&\":\"&MID(H7,3,2)&\":\"&RIGHT(H7,2)))","v":" "},null,{"$f":"IF(J7=0,\" \",TIMEVALUE(LEFT(J7,2)&\":\"&MID(J7,3,2)&\":\"&RIGHT(J7,2)))","v":" "},null,{"$f":"IF(L7=0,\" \",TIMEVALUE(LEFT(L7,2)&\":\"&MID(L7,3,2)&\":\"&RIGHT(L7,2)))","v":" "}]
[null,"TRAIN NUMBER"]
[null,"ENGINE:"]
[]
[null,"MP 0.1 - Depart Northbound",null,{"$f":"IF(C10=0,\" \",TIMEVALUE(LEFT(C10,2)&\":\"&MID(C10,3,2)&\":\"&RIGHT(C10,2)))","v":" "},null,{"$f":"IF(E10=0,\" \",TIMEVALUE(LEFT(E10,2)&\":\"&MID(E10,3,2)&\":\"&RIGHT(E10,2)))","v":" "},null,{"$f":"IF(G10=0,\" \",TIMEVALUE(LEFT(G10,2)&\":\"&MID(G10,3,2)&\":\"&RIGHT(G10,2)))","v":" "},null,{"$f":"IF(I10=0,\" \",TIMEVALUE(LEFT(I10,2)&\":\"&MID(I10,3,2)&\":\"&RIGHT(I10,2)))","v":" "},null,{"$f":"IF(K10=0,\" \",TIMEVALUE(LEFT(K10,2)&\":\"&MID(K10,3,2)&\":\"&RIGHT(K10,2)))","v":" "}]
[null,"Yard Limits*",null,{"$f":"IF(C10=0,\" \",$L$2)","v":" "},null,{"$f":"IF(E10=0,\" \",$L$2)","v":" "},null,{"$f":"IF(G10=0,\" \",$L$2)","v":" "},null,{"$f":"IF(I10=0,\" \",$L$2)","v":" "},null,{"$f":"IF(K10=0,\" \",$L$2)","v":" "}]
[null,"MP 2.1 - Midway Northbound",null,{"$f":"IF(C12=0,\" \",TIMEVALUE(LEFT(C12,2)&\":\"&MID(C12,3,2)&\":\"&RIGHT(C12,2)))","v":" "},null,{"$f":"IF(E12=0,\" \",TIMEVALUE(LEFT(E12,2)&\":\"&MID(E12,3,2)&\":\"&RIGHT(E12,2)))","v":" "},null,{"$f":"IF(G12=0,\" \",TIMEVALUE(LEFT(G12,2)&\":\"&MID(G12,3,2)&\":\"&RIGHT(G12,2)))","v":" "},null,{"$f":"IF(I12=0,\" \",TIMEVALUE(LEFT(I12,2)&\":\"&MID(I12,3,2)&\":\"&RIGHT(I12,2)))","v":" "},null,{"$f":"IF(K12=0,\" \",TIMEVALUE(LEFT(K12,2)&\":\"&MID(K12,3,2)&\":\"&RIGHT(K12,2)))","v":" "}]
[null,"MP 4.1 - Arr.  New Hill",null," ",null," ",null,{"$f":"IF(G13=0,\" \",TIMEVALUE(LEFT(G13,2)&\":\"&MID(G13,3,2)&\":\"&RIGHT(G13,2)))","v":" "},null,{"$f":"IF(I13=0,\" \",TIMEVALUE(LEFT(I13,2)&\":\"&MID(I13,3,2)&\":\"&RIGHT(I13,2)))","v":" "},null,{"$f":"IF(K13=0,\" \",TIMEVALUE(LEFT(K13,2)&\":\"&MID(K13,3,2)&\":\"&RIGHT(K13,2)))","v":" "}," "]
[null,"MP 4.1- Lv. New Hill - Southbound",null," ",null," ",null,{"$f":"IF(G14=0,\" \",TIMEVALUE(LEFT(G14,2)&\":\"&MID(G14,3,2)&\":\"&RIGHT(G14,2)))","v":" "},null,{"$f":"IF(I14=0,\" \",TIMEVALUE(LEFT(I14,2)&\":\"&MID(I14,3,2)&\":\"&RIGHT(I14,2)))","v":" "},null,{"$f":"IF(K14=0,\" \",TIMEVALUE(LEFT(K14,2)&\":\"&MID(K14,3,2)&\":\"&RIGHT(K14,2)))","v":" "}]
[null,"MP 2.1 - Midway Southbound",null," ",null," ",null,{"$f":"IF(G15=0,\" \",TIMEVALUE(LEFT(G15,2)&\":\"&MID(G15,3,2)&\":\"&RIGHT(G15,2)))","v":" "},null,{"$f":"IF(I15=0,\" \",TIMEVALUE(LEFT(I15,2)&\":\"&MID(I15,3,2)&\":\"&RIGHT(I15,2)))","v":" "},null,{"$f":"IF(K15=0,\" \",TIMEVALUE(LEFT(K15,2)&\":\"&MID(K15,3,2)&\":\"&RIGHT(K15,2)))","v":" "}]
{"$rows_left_out":37}